{"text_format":"1","workbook":"xlsx","n_sheets":3,"sheets":["Anthropometry","Tables","Reference Points"],"not_rendered":{"charts":0,"images":2,"macros":1,"external_links":0,"defined_names":1,"comments":2,"pivot_tables":0},"unopened":[],"bounds":{"document_bytes":16777216,"sheet_cells":100000,"rows_first":2000,"rows_last":500,"rows_between":2000,"halvings":0,"cell_chars":16384,"cell_head_chars":4096},"cells_cut":0,"cells_raw":0,"read":"whole","date_system":"1904"}

{"sheet":"Anthropometry","index":0,"n_rows":42,"n_cols":7,"rows_kept":42,"cut":false,"hidden":false,"merged":[[1,0,3,0],[5,4,5,5],[1,2,1,3],[5,2,5,3]]}
["Anthropometric Measures -- Adult Population"]
["Job / Task Information  --  Enter Useful Information in This Box  -- See also comments in cells by placing curser over cells marked by red triangle in upper right corner.",null,"Adult Population Mix (%)",null,null,"Design"]
[null,null,"Men","Women",null,"Exclusion (%)"]
[null,null,50,{"$f":"100-C4","v":50},null,5]
[2,null,null,"Units:",{"$f":"INDEX(Tables!I3:I4,A5,1)","v":"in, lb"}]
["If units are changed, push Find Values again.",null,"Limits (%ile)",null,"Range (%ile)"]
[null,"Mean","Minimum","Maximum","Low","High"]
["Select Dimensions of Interest","50%ile",{"$f":"Tables!O43","v":5},{"$f":"Tables!P43","v":95},{"$f":"Tables!Q43","v":2.5},{"$f":"Tables!R43","v":97.5}]
[2,{"$f":"Tables!R5","v":66.310200000000009},60.822499856340649,72.088743850576861,59.970650684298121,73.027994576006336,{"$f":"Tables!N45","v":""}]
[3,{"$f":"Tables!R6","v":164.56000000000003},105.17809530208504,226.42371504032789,94.623010983560192,238.08313386557583,{"$f":"Tables!N46","v":""}]
[1,{"$f":"Tables!R7","v":""},null,null,null,null,{"$f":"Tables!N47","v":""}]
[1,{"$f":"Tables!R8","v":""},null,null,null,null,{"$f":"Tables!N48","v":""}]
[1,{"$f":"Tables!R9","v":""},null,null,null,null,{"$f":"Tables!N49","v":""}]
[1,{"$f":"Tables!R10","v":""},null,null,null,null,{"$f":"Tables!N50","v":""}]
[1,{"$f":"Tables!R11","v":""},null,null,null,null,{"$f":"Tables!N51","v":""}]
[1,{"$f":"Tables!R12","v":""},null,null,null,null,{"$f":"Tables!N52","v":""}]
[1,{"$f":"Tables!R13","v":""},null,null,null,null,{"$f":"Tables!N53","v":""}]
[1,{"$f":"Tables!R14","v":""},null,null,null,null,{"$f":"Tables!N54","v":""}]
[1,{"$f":"Tables!R15","v":""},null,null,null,null,{"$f":"Tables!N55","v":""}]
[]
[null,null,{"$f":"IF(OR(G9=\"*\",G10=\"*\",G11=\"*\",G12=\"*\",G13=\"*\",G14=\"*\",G15=\"*\",G16=\"*\",G17=\"*\",G18=\"*\",G19=\"*\"),\"*  Press Find Values\",\"\")","v":""}]
[null,null,{"$f":"IF(C21=\"\",\"\",\"If * at end of row remains, there is a computation error.\")","v":""}]
[]
[{"$f":"Tables!B51","v":"Thomas E. Bernard"}]
[{"$f":"Tables!B52","v":"University of South Florida"}]
[{"$f":"Tables!B53","v":"College of Public Health"}]
[{"$f":"Tables!B54","v":"Tampa FL 33612-3805"}]
[{"$f":"Tables!B55","v":"tbernard@hsc.usf.edu // (813) 974-6629"}]
[{"$f":"Tables!B56","v":"v1.3 10/7/00 © 2000 Thomas E. Bernard"}]
[{"$f":"Tables!B57","v":"For updates, see Stone Wheels at www.hsc.usf.edu/~tbernard"}]
[{"$f":"Tables!B58","v":"No Warranty -- Explicit or Implicit"}]
[]
[]
[]
[]
[]
[]
[]
[]
[]
{"$rows_left_out":3}
{"sheet":"Tables","index":1,"n_rows":58,"n_cols":18,"rows_kept":58,"cut":false,"hidden":false,"merged":[[2,2,2,4],[2,5,2,7],[0,2,0,7]]}
[null,"Tables","Data Table in SI units",null,null,null,null,null,"Conversions"]
[null,"Data from Ergonomic Design for People at Work, Vol 1",null,null,null,null,null,null,"to US Trad",null,"Data for selected dimensions in selected units"]
[null,"Table VIA-2, pp 290-293","Men",null,null,"Women",null,null,"cm, kg",null,"Men",null,null,"Women",null,null,null,"Weighted"]
["Index","The table section in Yellow may be edited.","Mean","-sd","+sd","Mean","-sd","+sd","in, lb","Index","Mean","-sd","+sd","Mean","-sd","+sd",null,"Mean"]
[1,"None",0,null,null,0,null,null,0,{"$f":"Anthropometry!A9","v":2},{"$f":"IF(Anthropometry!$A$5=1,INDEX($C$5:$H$49,$J5,1),INDEX($C$5:$I$49,$J5,7)*INDEX($C$5:$H$49,$J5,1))","v":68.753},{"$f":"IF(Anthropometry!$A$5=1,INDEX($C$5:$H$49,$J5,2),INDEX($C$5:$I$49,$J5,7)*INDEX($C$5:$H$49,$J5,2))","v":2.6004},{"$f":"IF(Anthropometry!$A$5=1,INDEX($C$5:$H$49,$J5,3),INDEX($C$5:$I$49,$J5,7)*INDEX($C$5:$H$49,$J5,3))","v":2.6004},{"$f":"IF(Anthropometry!$A$5=1,INDEX($C$5:$H$49,$J5,4),INDEX($C$5:$I$49,$J5,7)*INDEX($C$5:$H$49,$J5,4))","v":63.867400000000004},{"$f":"IF(Anthropometry!$A$5=1,INDEX($C$5:$H$49,$J5,5),INDEX($C$5:$I$49,$J5,7)*INDEX($C$5:$H$49,$J5,5))","v":2.3639999999999999},{"$f":"IF(Anthropometry!$A$5=1,INDEX($C$5:$H$49,$J5,6),INDEX($C$5:$I$49,$J5,7)*INDEX($C$5:$H$49,$J5,6))","v":2.3639999999999999},null,{"$f":"IF(J5=1,\"\",(Anthropometry!$C$4*K5+Anthropometry!$D$4*N5)/100)","v":66.310200000000009}]
[2,"Stature {9}",174.5,6.6,6.6,162.1,6,6,0.39400000000000002,{"$f":"Anthropometry!A10","v":3},{"$f":"IF(Anthropometry!$A$5=1,INDEX($C$5:$H$49,$J6,1),INDEX($C$5:$I$49,$J6,7)*INDEX($C$5:$H$49,$J6,1))","v":183.04000000000002},{"$f":"IF(Anthropometry!$A$5=1,INDEX($C$5:$H$49,$J6,2),INDEX($C$5:$I$49,$J6,7)*INDEX($C$5:$H$49,$J6,2))","v":33.22},{"$f":"IF(Anthropometry!$A$5=1,INDEX($C$5:$H$49,$J6,3),INDEX($C$5:$I$49,$J6,7)*INDEX($C$5:$H$49,$J6,3))","v":33.22},{"$f":"IF(Anthropometry!$A$5=1,INDEX($C$5:$H$49,$J6,4),INDEX($C$5:$I$49,$J6,7)*INDEX($C$5:$H$49,$J6,4))","v":146.08000000000001},{"$f":"IF(Anthropometry!$A$5=1,INDEX($C$5:$H$49,$J6,5),INDEX($C$5:$I$49,$J6,7)*INDEX($C$5:$H$49,$J6,5))","v":30.580000000000002},{"$f":"IF(Anthropometry!$A$5=1,INDEX($C$5:$H$49,$J6,6),INDEX($C$5:$I$49,$J6,7)*INDEX($C$5:$H$49,$J6,6))","v":30.580000000000002},null,{"$f":"IF(J6=1,\"\",(Anthropometry!$C$4*K6+Anthropometry!$D$4*N6)/100)","v":164.56000000000003}]
[3,"Weight {43}",83.2,15.1,15.1,66.400000000000006,13.9,13.9,2.2000000000000002,{"$f":"Anthropometry!A11","v":1},{"$f":"IF(Anthropometry!$A$5=1,INDEX($C$5:$H$49,$J7,1),INDEX($C$5:$I$49,$J7,7)*INDEX($C$5:$H$49,$J7,1))","v":0},{"$f":"IF(Anthropometry!$A$5=1,INDEX($C$5:$H$49,$J7,2),INDEX($C$5:$I$49,$J7,7)*INDEX($C$5:$H$49,$J7,2))","v":0},{"$f":"IF(Anthropometry!$A$5=1,INDEX($C$5:$H$49,$J7,3),INDEX($C$5:$I$49,$J7,7)*INDEX($C$5:$H$49,$J7,3))","v":0},{"$f":"IF(Anthropometry!$A$5=1,INDEX($C$5:$H$49,$J7,4),INDEX($C$5:$I$49,$J7,7)*INDEX($C$5:$H$49,$J7,4))","v":0},{"$f":"IF(Anthropometry!$A$5=1,INDEX($C$5:$H$49,$J7,5),INDEX($C$5:$I$49,$J7,7)*INDEX($C$5:$H$49,$J7,5))","v":0},{"$f":"IF(Anthropometry!$A$5=1,INDEX($C$5:$H$49,$J7,6),INDEX($C$5:$I$49,$J7,7)*INDEX($C$5:$H$49,$J7,6))","v":0},null,{"$f":"IF(J7=1,\"\",(Anthropometry!$C$4*K7+Anthropometry!$D$4*N7)/100)","v":""}]
[4,"Forward Functional Reach - Inc body depth {1a}",82.6,4.8,4.8,74.099999999999994,3.9,3.9,0.39400000000000002,{"$f":"Anthropometry!A12","v":1},{"$f":"IF(Anthropometry!$A$5=1,INDEX($C$5:$H$49,$J8,1),INDEX($C$5:$I$49,$J8,7)*INDEX($C$5:$H$49,$J8,1))","v":0},{"$f":"IF(Anthropometry!$A$5=1,INDEX($C$5:$H$49,$J8,2),INDEX($C$5:$I$49,$J8,7)*INDEX($C$5:$H$49,$J8,2))","v":0},{"$f":"IF(Anthropometry!$A$5=1,INDEX($C$5:$H$49,$J8,3),INDEX($C$5:$I$49,$J8,7)*INDEX($C$5:$H$49,$J8,3))","v":0},{"$f":"IF(Anthropometry!$A$5=1,INDEX($C$5:$H$49,$J8,4),INDEX($C$5:$I$49,$J8,7)*INDEX($C$5:$H$49,$J8,4))","v":0},{"$f":"IF(Anthropometry!$A$5=1,INDEX($C$5:$H$49,$J8,5),INDEX($C$5:$I$49,$J8,7)*INDEX($C$5:$H$49,$J8,5))","v":0},{"$f":"IF(Anthropometry!$A$5=1,INDEX($C$5:$H$49,$J8,6),INDEX($C$5:$I$49,$J8,7)*INDEX($C$5:$H$49,$J8,6))","v":0},null,{"$f":"IF(J8=1,\"\",(Anthropometry!$C$4*K8+Anthropometry!$D$4*N8)/100)","v":""}]
[5,"Frwd Func Reach - acromial process to pinch {1b}",63.8,4.3,4.3,62.5,3.4,3.4,0.39400000000000002,{"$f":"Anthropometry!A13","v":1},{"$f":"IF(Anthropometry!$A$5=1,INDEX($C$5:$H$49,$J9,1),INDEX($C$5:$I$49,$J9,7)*INDEX($C$5:$H$49,$J9,1))","v":0},{"$f":"IF(Anthropometry!$A$5=1,INDEX($C$5:$H$49,$J9,2),INDEX($C$5:$I$49,$J9,7)*INDEX($C$5:$H$49,$J9,2))","v":0},{"$f":"IF(Anthropometry!$A$5=1,INDEX($C$5:$H$49,$J9,3),INDEX($C$5:$I$49,$J9,7)*INDEX($C$5:$H$49,$J9,3))","v":0},{"$f":"IF(Anthropometry!$A$5=1,INDEX($C$5:$H$49,$J9,4),INDEX($C$5:$I$49,$J9,7)*INDEX($C$5:$H$49,$J9,4))","v":0},{"$f":"IF(Anthropometry!$A$5=1,INDEX($C$5:$H$49,$J9,5),INDEX($C$5:$I$49,$J9,7)*INDEX($C$5:$H$49,$J9,5))","v":0},{"$f":"IF(Anthropometry!$A$5=1,INDEX($C$5:$H$49,$J9,6),INDEX($C$5:$I$49,$J9,7)*INDEX($C$5:$H$49,$J9,6))","v":0},null,{"$f":"IF(J9=1,\"\",(Anthropometry!$C$4*K9+Anthropometry!$D$4*N9)/100)","v":""}]
[6,"Frwd Func Reach - abdomen to pinch {1c}",62.1,8.9,8.9,60.4,6.7,6.7,0.39400000000000002,{"$f":"Anthropometry!A14","v":1},{"$f":"IF(Anthropometry!$A$5=1,INDEX($C$5:$H$49,$J10,1),INDEX($C$5:$I$49,$J10,7)*INDEX($C$5:$H$49,$J10,1))","v":0},{"$f":"IF(Anthropometry!$A$5=1,INDEX($C$5:$H$49,$J10,2),INDEX($C$5:$I$49,$J10,7)*INDEX($C$5:$H$49,$J10,2))","v":0},{"$f":"IF(Anthropometry!$A$5=1,INDEX($C$5:$H$49,$J10,3),INDEX($C$5:$I$49,$J10,7)*INDEX($C$5:$H$49,$J10,3))","v":0},{"$f":"IF(Anthropometry!$A$5=1,INDEX($C$5:$H$49,$J10,4),INDEX($C$5:$I$49,$J10,7)*INDEX($C$5:$H$49,$J10,4))","v":0},{"$f":"IF(Anthropometry!$A$5=1,INDEX($C$5:$H$49,$J10,5),INDEX($C$5:$I$49,$J10,7)*INDEX($C$5:$H$49,$J10,5))","v":0},{"$f":"IF(Anthropometry!$A$5=1,INDEX($C$5:$H$49,$J10,6),INDEX($C$5:$I$49,$J10,7)*INDEX($C$5:$H$49,$J10,6))","v":0},null,{"$f":"IF(J10=1,\"\",(Anthropometry!$C$4*K10+Anthropometry!$D$4*N10)/100)","v":""}]
[7,"Abdominal Extension Depth {2}",23.1,2,2,20.9,2.1,2.1,0.39400000000000002,{"$f":"Anthropometry!A15","v":1},{"$f":"IF(Anthropometry!$A$5=1,INDEX($C$5:$H$49,$J11,1),INDEX($C$5:$I$49,$J11,7)*INDEX($C$5:$H$49,$J11,1))","v":0},{"$f":"IF(Anthropometry!$A$5=1,INDEX($C$5:$H$49,$J11,2),INDEX($C$5:$I$49,$J11,7)*INDEX($C$5:$H$49,$J11,2))","v":0},{"$f":"IF(Anthropometry!$A$5=1,INDEX($C$5:$H$49,$J11,3),INDEX($C$5:$I$49,$J11,7)*INDEX($C$5:$H$49,$J11,3))","v":0},{"$f":"IF(Anthropometry!$A$5=1,INDEX($C$5:$H$49,$J11,4),INDEX($C$5:$I$49,$J11,7)*INDEX($C$5:$H$49,$J11,4))","v":0},{"$f":"IF(Anthropometry!$A$5=1,INDEX($C$5:$H$49,$J11,5),INDEX($C$5:$I$49,$J11,7)*INDEX($C$5:$H$49,$J11,5))","v":0},{"$f":"IF(Anthropometry!$A$5=1,INDEX($C$5:$H$49,$J11,6),INDEX($C$5:$I$49,$J11,7)*INDEX($C$5:$H$49,$J11,6))","v":0},null,{"$f":"IF(J11=1,\"\",(Anthropometry!$C$4*K11+Anthropometry!$D$4*N11)/100)","v":""}]
[8,"Waist Height - Stand {3}",106.3,5.4,5.4,101.7,5,5,0.39400000000000002,{"$f":"Anthropometry!A16","v":1},{"$f":"IF(Anthropometry!$A$5=1,INDEX($C$5:$H$49,$J12,1),INDEX($C$5:$I$49,$J12,7)*INDEX($C$5:$H$49,$J12,1))","v":0},{"$f":"IF(Anthropometry!$A$5=1,INDEX($C$5:$H$49,$J12,2),INDEX($C$5:$I$49,$J12,7)*INDEX($C$5:$H$49,$J12,2))","v":0},{"$f":"IF(Anthropometry!$A$5=1,INDEX($C$5:$H$49,$J12,3),INDEX($C$5:$I$49,$J12,7)*INDEX($C$5:$H$49,$J12,3))","v":0},{"$f":"IF(Anthropometry!$A$5=1,INDEX($C$5:$H$49,$J12,4),INDEX($C$5:$I$49,$J12,7)*INDEX($C$5:$H$49,$J12,4))","v":0},{"$f":"IF(Anthropometry!$A$5=1,INDEX($C$5:$H$49,$J12,5),INDEX($C$5:$I$49,$J12,7)*INDEX($C$5:$H$49,$J12,5))","v":0},{"$f":"IF(Anthropometry!$A$5=1,INDEX($C$5:$H$49,$J12,6),INDEX($C$5:$I$49,$J12,7)*INDEX($C$5:$H$49,$J12,6))","v":0},null,{"$f":"IF(J12=1,\"\",(Anthropometry!$C$4*K12+Anthropometry!$D$4*N12)/100)","v":""}]
[9,"Tibial Height {4}",45.6,2.8,2.8,42,2.4,2.4,0.39400000000000002,{"$f":"Anthropometry!A17","v":1},{"$f":"IF(Anthropometry!$A$5=1,INDEX($C$5:$H$49,$J13,1),INDEX($C$5:$I$49,$J13,7)*INDEX($C$5:$H$49,$J13,1))","v":0},{"$f":"IF(Anthropometry!$A$5=1,INDEX($C$5:$H$49,$J13,2),INDEX($C$5:$I$49,$J13,7)*INDEX($C$5:$H$49,$J13,2))","v":0},{"$f":"IF(Anthropometry!$A$5=1,INDEX($C$5:$H$49,$J13,3),INDEX($C$5:$I$49,$J13,7)*INDEX($C$5:$H$49,$J13,3))","v":0},{"$f":"IF(Anthropometry!$A$5=1,INDEX($C$5:$H$49,$J13,4),INDEX($C$5:$I$49,$J13,7)*INDEX($C$5:$H$49,$J13,4))","v":0},{"$f":"IF(Anthropometry!$A$5=1,INDEX($C$5:$H$49,$J13,5),INDEX($C$5:$I$49,$J13,7)*INDEX($C$5:$H$49,$J13,5))","v":0},{"$f":"IF(Anthropometry!$A$5=1,INDEX($C$5:$H$49,$J13,6),INDEX($C$5:$I$49,$J13,7)*INDEX($C$5:$H$49,$J13,6))","v":0},null,{"$f":"IF(J13=1,\"\",(Anthropometry!$C$4*K13+Anthropometry!$D$4*N13)/100)","v":""}]
[10,"Knuckle Height - Stand {5}",75.5,4.0999999999999996,4.0999999999999996,71,4,4,0.39400000000000002,{"$f":"Anthropometry!A18","v":1},{"$f":"IF(Anthropometry!$A$5=1,INDEX($C$5:$H$49,$J14,1),INDEX($C$5:$I$49,$J14,7)*INDEX($C$5:$H$49,$J14,1))","v":0},{"$f":"IF(Anthropometry!$A$5=1,INDEX($C$5:$H$49,$J14,2),INDEX($C$5:$I$49,$J14,7)*INDEX($C$5:$H$49,$J14,2))","v":0},{"$f":"IF(Anthropometry!$A$5=1,INDEX($C$5:$H$49,$J14,3),INDEX($C$5:$I$49,$J14,7)*INDEX($C$5:$H$49,$J14,3))","v":0},{"$f":"IF(Anthropometry!$A$5=1,INDEX($C$5:$H$49,$J14,4),INDEX($C$5:$I$49,$J14,7)*INDEX($C$5:$H$49,$J14,4))","v":0},{"$f":"IF(Anthropometry!$A$5=1,INDEX($C$5:$H$49,$J14,5),INDEX($C$5:$I$49,$J14,7)*INDEX($C$5:$H$49,$J14,5))","v":0},{"$f":"IF(Anthropometry!$A$5=1,INDEX($C$5:$H$49,$J14,6),INDEX($C$5:$I$49,$J14,7)*INDEX($C$5:$H$49,$J14,6))","v":0},null,{"$f":"IF(J14=1,\"\",(Anthropometry!$C$4*K14+Anthropometry!$D$4*N14)/100)","v":""}]
[11,"Elbow Height - Stand {6}",110.5,4.5,4.5,102.6,4.8,4.8,0.39400000000000002,{"$f":"Anthropometry!A19","v":1},{"$f":"IF(Anthropometry!$A$5=1,INDEX($C$5:$H$49,$J15,1),INDEX($C$5:$I$49,$J15,7)*INDEX($C$5:$H$49,$J15,1))","v":0},{"$f":"IF(Anthropometry!$A$5=1,INDEX($C$5:$H$49,$J15,2),INDEX($C$5:$I$49,$J15,7)*INDEX($C$5:$H$49,$J15,2))","v":0},{"$f":"IF(Anthropometry!$A$5=1,INDEX($C$5:$H$49,$J15,3),INDEX($C$5:$I$49,$J15,7)*INDEX($C$5:$H$49,$J15,3))","v":0},{"$f":"IF(Anthropometry!$A$5=1,INDEX($C$5:$H$49,$J15,4),INDEX($C$5:$I$49,$J15,7)*INDEX($C$5:$H$49,$J15,4))","v":0},{"$f":"IF(Anthropometry!$A$5=1,INDEX($C$5:$H$49,$J15,5),INDEX($C$5:$I$49,$J15,7)*INDEX($C$5:$H$49,$J15,5))","v":0},{"$f":"IF(Anthropometry!$A$5=1,INDEX($C$5:$H$49,$J15,6),INDEX($C$5:$I$49,$J15,7)*INDEX($C$5:$H$49,$J15,6))","v":0},null,{"$f":"IF(J15=1,\"\",(Anthropometry!$C$4*K15+Anthropometry!$D$4*N15)/100)","v":""}]
[12,"Shoulder Height - Stand {7}",143.69999999999999,6.2,6.2,132.9,5.5,5.5,0.39400000000000002]
[13,"Eye Height - Stand {8}",164.4,6.1,6.1,151.4,5.6,5.6,0.39400000000000002,"Index","+/- standard deviations in selected units for min, max, low, high"]
[14,"Functional Overhead Reach - Stand {10}",209.6,8.5,8.5,199.2,8.6,8.6,0.39400000000000002,{"$f":"J5","v":2},{"$f":"IF(Anthropometry!C9<$K5,$L5,$M5)","v":2.6004},{"$f":"IF(Anthropometry!D9<$K5,$L5,$M5)","v":2.6004},{"$f":"IF(Anthropometry!E9<$K5,$L5,$M5)","v":2.6004},{"$f":"IF(Anthropometry!F9<$K5,$L5,$M5)","v":2.6004},{"$f":"IF(Anthropometry!C9<$N5,$O5,$P5)","v":2.3639999999999999},{"$f":"IF(Anthropometry!D9<$N5,$O5,$P5)","v":2.3639999999999999},{"$f":"IF(Anthropometry!E9<$N5,$O5,$P5)","v":2.3639999999999999},{"$f":"IF(Anthropometry!F9<$N5,$O5,$P5)","v":2.3639999999999999}]
[15,"Thigh Clearance Height - Sit {11}",14.7,1.4,1.4,12.4,1.2,1.2,0.39400000000000002,3,{"$f":"IF(Anthropometry!C10<$K6,$L6,$M6)","v":33.22},{"$f":"IF(Anthropometry!D10<$K6,$L6,$M6)","v":33.22},{"$f":"IF(Anthropometry!E10<$K6,$L6,$M6)","v":33.22},{"$f":"IF(Anthropometry!F10<$K6,$L6,$M6)","v":33.22},{"$f":"IF(Anthropometry!C10<$N6,$O6,$P6)","v":30.580000000000002},{"$f":"IF(Anthropometry!D10<$N6,$O6,$P6)","v":30.580000000000002},{"$f":"IF(Anthropometry!E10<$N6,$O6,$P6)","v":30.580000000000002},{"$f":"IF(Anthropometry!F10<$N6,$O6,$P6)","v":30.580000000000002}]
[16,"Elbow Rest Height - Sit {12}",24.1,3.2,3.2,23.1,3,3,0.39400000000000002,1,{"$f":"IF(Anthropometry!C11<$K7,$L7,$M7)","v":0},{"$f":"IF(Anthropometry!D11<$K7,$L7,$M7)","v":0},{"$f":"IF(Anthropometry!E11<$K7,$L7,$M7)","v":0},{"$f":"IF(Anthropometry!F11<$K7,$L7,$M7)","v":0},{"$f":"IF(Anthropometry!C11<$N7,$O7,$P7)","v":0},{"$f":"IF(Anthropometry!D11<$N7,$O7,$P7)","v":0},{"$f":"IF(Anthropometry!E11<$N7,$O7,$P7)","v":0},{"$f":"IF(Anthropometry!F11<$N7,$O7,$P7)","v":0}]
[17,"Midshoulder Height - Sit {13}",62.4,3.2,3.2,58,2.7,2.7,0.39400000000000002,1,{"$f":"IF(Anthropometry!C12<$K8,$L8,$M8)","v":0},{"$f":"IF(Anthropometry!D12<$K8,$L8,$M8)","v":0},{"$f":"IF(Anthropometry!E12<$K8,$L8,$M8)","v":0},{"$f":"IF(Anthropometry!F12<$K8,$L8,$M8)","v":0},{"$f":"IF(Anthropometry!C12<$N8,$O8,$P8)","v":0},{"$f":"IF(Anthropometry!D12<$N8,$O8,$P8)","v":0},{"$f":"IF(Anthropometry!E12<$N8,$O8,$P8)","v":0},{"$f":"IF(Anthropometry!F12<$N8,$O8,$P8)","v":0}]
[18,"Eye Height - Sit {14}",78.7,3.6,3.6,73.7,3.1,3.1,0.39400000000000002,1,{"$f":"IF(Anthropometry!C13<$K9,$L9,$M9)","v":0},{"$f":"IF(Anthropometry!D13<$K9,$L9,$M9)","v":0},{"$f":"IF(Anthropometry!E13<$K9,$L9,$M9)","v":0},{"$f":"IF(Anthropometry!F13<$K9,$L9,$M9)","v":0},{"$f":"IF(Anthropometry!C13<$N9,$O9,$P9)","v":0},{"$f":"IF(Anthropometry!D13<$N9,$O9,$P9)","v":0},{"$f":"IF(Anthropometry!E13<$N9,$O9,$P9)","v":0},{"$f":"IF(Anthropometry!F13<$N9,$O9,$P9)","v":0}]
[19,"Sitting Height - Normal {15}",86.6,3.8,3.8,81.8,4,4,0.39400000000000002,1,{"$f":"IF(Anthropometry!C14<$K10,$L10,$M10)","v":0},{"$f":"IF(Anthropometry!D14<$K10,$L10,$M10)","v":0},{"$f":"IF(Anthropometry!E14<$K10,$L10,$M10)","v":0},{"$f":"IF(Anthropometry!F14<$K10,$L10,$M10)","v":0},{"$f":"IF(Anthropometry!C14<$N10,$O10,$P10)","v":0},{"$f":"IF(Anthropometry!D14<$N10,$O10,$P10)","v":0},{"$f":"IF(Anthropometry!E14<$N10,$O10,$P10)","v":0},{"$f":"IF(Anthropometry!F14<$N10,$O10,$P10)","v":0}]
[20,"Functional Overhead Reach - Sit {16}",128.4,8.5,8.5,119.8,6.6,6.6,0.39400000000000002,1,{"$f":"IF(Anthropometry!C15<$K11,$L11,$M11)","v":0},{"$f":"IF(Anthropometry!D15<$K11,$L11,$M11)","v":0},{"$f":"IF(Anthropometry!E15<$K11,$L11,$M11)","v":0},{"$f":"IF(Anthropometry!F15<$K11,$L11,$M11)","v":0},{"$f":"IF(Anthropometry!C15<$N11,$O11,$P11)","v":0},{"$f":"IF(Anthropometry!D15<$N11,$O11,$P11)","v":0},{"$f":"IF(Anthropometry!E15<$N11,$O11,$P11)","v":0},{"$f":"IF(Anthropometry!F15<$N11,$O11,$P11)","v":0}]
[21,"Knee Height - Sit {17}",54,2.7,2.7,51,2.6,2.6,0.39400000000000002,1,{"$f":"IF(Anthropometry!C16<$K12,$L12,$M12)","v":0},{"$f":"IF(Anthropometry!D16<$K12,$L12,$M12)","v":0},{"$f":"IF(Anthropometry!E16<$K12,$L12,$M12)","v":0},{"$f":"IF(Anthropometry!F16<$K12,$L12,$M12)","v":0},{"$f":"IF(Anthropometry!C16<$N12,$O12,$P12)","v":0},{"$f":"IF(Anthropometry!D16<$N12,$O12,$P12)","v":0},{"$f":"IF(Anthropometry!E16<$N12,$O12,$P12)","v":0},{"$f":"IF(Anthropometry!F16<$N12,$O12,$P12)","v":0}]
[22,"Popliteal Height - Sit {18}",44.6,2.5,2.5,41,1.9,1.9,0.39400000000000002,1,{"$f":"IF(Anthropometry!C17<$K13,$L13,$M13)","v":0},{"$f":"IF(Anthropometry!D17<$K13,$L13,$M13)","v":0},{"$f":"IF(Anthropometry!E17<$K13,$L13,$M13)","v":0},{"$f":"IF(Anthropometry!F17<$K13,$L13,$M13)","v":0},{"$f":"IF(Anthropometry!C17<$N13,$O13,$P13)","v":0},{"$f":"IF(Anthropometry!D17<$N13,$O13,$P13)","v":0},{"$f":"IF(Anthropometry!E17<$N13,$O13,$P13)","v":0},{"$f":"IF(Anthropometry!F17<$N13,$O13,$P13)","v":0}]
[23,"Leg Length - Sit {19}",105.1,4.8,4.8,100.7,4.3,4.3,0.39400000000000002,1,{"$f":"IF(Anthropometry!C18<$K14,$L14,$M14)","v":0},{"$f":"IF(Anthropometry!D18<$K14,$L14,$M14)","v":0},{"$f":"IF(Anthropometry!E18<$K14,$L14,$M14)","v":0},{"$f":"IF(Anthropometry!F18<$K14,$L14,$M14)","v":0},{"$f":"IF(Anthropometry!C18<$N14,$O14,$P14)","v":0},{"$f":"IF(Anthropometry!D18<$N14,$O14,$P14)","v":0},{"$f":"IF(Anthropometry!E18<$N14,$O14,$P14)","v":0},{"$f":"IF(Anthropometry!F18<$N14,$O14,$P14)","v":0}]
[24,"Upper-Leg Length - Sit {20}",59.4,2.8,2.8,57.4,2.6,2.6,0.39400000000000002,1,{"$f":"IF(Anthropometry!C19<$K15,$L15,$M15)","v":0},{"$f":"IF(Anthropometry!D19<$K15,$L15,$M15)","v":0},{"$f":"IF(Anthropometry!E19<$K15,$L15,$M15)","v":0},{"$f":"IF(Anthropometry!F19<$K15,$L15,$M15)","v":0},{"$f":"IF(Anthropometry!C19<$N15,$O15,$P15)","v":0},{"$f":"IF(Anthropometry!D19<$N15,$O15,$P15)","v":0},{"$f":"IF(Anthropometry!E19<$N15,$O15,$P15)","v":0},{"$f":"IF(Anthropometry!F19<$N15,$O15,$P15)","v":0}]
[25,"Buttocks-to-Popliteal Length - Sit {21}",49.8,2.5,2.5,48,3.2,3.2,0.39400000000000002]
[26,"Elbow-to-Fist Length {22}",38.5,2.1,2.1,34.799999999999997,2.2999999999999998,2.2999999999999998,0.39400000000000002,"Index","Goal Seek Difference"]
[27,"Upper-Arm Length {23}",36.9,1.9,1.9,34.1,2.5,2.5,0.39400000000000002,{"$f":"J5","v":2},{"$f":"IF($J31=1,\"\",Tables!O$43-Tables!O45)","v":-6.6132484248004886E-4},{"$f":"IF($J31=1,\"\",Tables!P$43-Tables!P45)","v":1.8620188678966088E-3},{"$f":"IF($J31=1,\"\",Tables!Q$43-Tables!Q45)","v":-2.1331160623905276E-4},{"$f":"IF($J31=1,\"\",Tables!R$43-Tables!R45)","v":7.1953982044306031E-3}]
[28,"Shoulder Breadth {24}",45.4,1.9,1.9,39,2.1,2.1,0.39400000000000002,{"$f":"J6","v":3},{"$f":"IF($J32=1,\"\",Tables!O$43-Tables!O46)","v":-3.3557811829698636E-3},{"$f":"IF($J32=1,\"\",Tables!P$43-Tables!P46)","v":4.3700236887787014E-3},{"$f":"IF($J32=1,\"\",Tables!Q$43-Tables!Q46)","v":-5.2751868093987575E-3},{"$f":"IF($J32=1,\"\",Tables!R$43-Tables!R46)","v":3.9655644767861986E-3}]
[29,"Hip Breadth {25}",35.6,2.2999999999999998,2.2999999999999998,38,2.6,2.6,0.39400000000000002,1,{"$f":"IF($J33=1,\"\",Tables!O$43-Tables!O47)","v":""},{"$f":"IF($J33=1,\"\",Tables!P$43-Tables!P47)","v":""},{"$f":"IF($J33=1,\"\",Tables!Q$43-Tables!Q47)","v":""},{"$f":"IF($J33=1,\"\",Tables!R$43-Tables!R47)","v":""}]
[30,"Foot Length {26}",26.8,1.3,1.3,24.1,1.1000000000000001,1.1000000000000001,0.39400000000000002,1,{"$f":"IF($J34=1,\"\",Tables!O$43-Tables!O48)","v":""},{"$f":"IF($J34=1,\"\",Tables!P$43-Tables!P48)","v":""},{"$f":"IF($J34=1,\"\",Tables!Q$43-Tables!Q48)","v":""},{"$f":"IF($J34=1,\"\",Tables!R$43-Tables!R48)","v":""}]
[31,"Foot Breadth {27}",10,0.6,0.6,8.9,0.5,0.5,0.39400000000000002,1,{"$f":"IF($J35=1,\"\",Tables!O$43-Tables!O49)","v":""},{"$f":"IF($J35=1,\"\",Tables!P$43-Tables!P49)","v":""},{"$f":"IF($J35=1,\"\",Tables!Q$43-Tables!Q49)","v":""},{"$f":"IF($J35=1,\"\",Tables!R$43-Tables!R49)","v":""}]
[32,"Hand Thickness, Metacarpal III {28}",3.3,0.2,0.2,2.8,0.2,0.2,0.39400000000000002,1,{"$f":"IF($J36=1,\"\",Tables!O$43-Tables!O50)","v":""},{"$f":"IF($J36=1,\"\",Tables!P$43-Tables!P50)","v":""},{"$f":"IF($J36=1,\"\",Tables!Q$43-Tables!Q50)","v":""},{"$f":"IF($J36=1,\"\",Tables!R$43-Tables!R50)","v":""}]
[33,"Hand Length {29}",19,1,1,18.399999999999999,1,1,0.39400000000000002,1,{"$f":"IF($J37=1,\"\",Tables!O$43-Tables!O51)","v":""},{"$f":"IF($J37=1,\"\",Tables!P$43-Tables!P51)","v":""},{"$f":"IF($J37=1,\"\",Tables!Q$43-Tables!Q51)","v":""},{"$f":"IF($J37=1,\"\",Tables!R$43-Tables!R51)","v":""}]
[34,"Digit Two Length {30}",7.5,0.7,0.7,6.9,0.8,0.8,0.39400000000000002,1,{"$f":"IF($J38=1,\"\",Tables!O$43-Tables!O52)","v":""},{"$f":"IF($J38=1,\"\",Tables!P$43-Tables!P52)","v":""},{"$f":"IF($J38=1,\"\",Tables!Q$43-Tables!Q52)","v":""},{"$f":"IF($J38=1,\"\",Tables!R$43-Tables!R52)","v":""}]
[35,"Hand Breadth {31}",8.6999999999999993,0.5,0.5,7.7,0.5,0.5,0.39400000000000002,1,{"$f":"IF($J39=1,\"\",Tables!O$43-Tables!O53)","v":""},{"$f":"IF($J39=1,\"\",Tables!P$43-Tables!P53)","v":""},{"$f":"IF($J39=1,\"\",Tables!Q$43-Tables!Q53)","v":""},{"$f":"IF($J39=1,\"\",Tables!R$43-Tables!R53)","v":""}]
[36,"Digit One Length {32}",12.7,1.1000000000000001,1.1000000000000001,11,1,1,0.39400000000000002,1,{"$f":"IF($J40=1,\"\",Tables!O$43-Tables!O54)","v":""},{"$f":"IF($J40=1,\"\",Tables!P$43-Tables!P54)","v":""},{"$f":"IF($J40=1,\"\",Tables!Q$43-Tables!Q54)","v":""},{"$f":"IF($J40=1,\"\",Tables!R$43-Tables!R54)","v":""}]
{"$rows_left_out":19}
{"sheet":"Reference Points","index":2,"n_rows":3,"n_cols":1,"rows_kept":3,"cut":false,"hidden":false,"merged":[]}
["Location References"]
["Information from Ergonomic Design for People at Work, Vol 1"]
["pp 299-310"]